Target
Adenosine deaminase
Ligand
BDBM50029136
Substrate
Meas. Tech.
ChEMBL_30809 (CHEMBL645084)
pH
7±n/a
Ki
800000±n/a nM
Comments
extracted
Citation
 Grant, AJLerner, LM Heat-induced formation of alpha,beta-unsaturated nucleoside dialdehydes and their activity with adenosine deaminase. J Med Chem 23:795-8 (1980)  
Target
Name:
Adenosine deaminase
Synonyms:
ADA Adenosine aminohydrolase
Type:
Enzyme
Mol. Mass.:
40910.44
Organism:
Bos taurus (bovine)
Description:
Residue:
363
  
Inhibitor
Name:
BDBM50029136
Synonyms:
(2S)-2-(6-amino-9H-purin-9-yl)-2-(2-oxoethoxy)acetaldehyde | CHEMBL353079
Type:
Small organic molecule
Emp. Form.:
C9H9N5O3
Mol. Mass.:
235.1995
SMILES:
Nc1ncnc2n(cnc12)[C@@H](OCC=O)C=O
: