Target
Adenosine deaminase
Ligand
BDBM50029133
Substrate
Meas. Tech.
ChEMBL_30809 (CHEMBL645084)
pH
7±n/a
Ki
8000±n/a nM
Comments
extracted
Citation
 Grant, AJLerner, LM Heat-induced formation of alpha,beta-unsaturated nucleoside dialdehydes and their activity with adenosine deaminase. J Med Chem 23:795-8 (1980)  
Target
Name:
Adenosine deaminase
Synonyms:
ADA Adenosine aminohydrolase
Type:
Enzyme
Mol. Mass.:
40910.44
Organism:
Bos taurus (bovine)
Description:
Residue:
363
  
Inhibitor
Name:
BDBM50029133
Synonyms:
(2R)-2-[(1S)-1-(6-amino-9H-purin-9-yl)-2-oxoethoxy]-3-hydroxypropanal | CHEMBL349866
Type:
Small organic molecule
Emp. Form.:
C10H11N5O4
Mol. Mass.:
265.2254
SMILES:
Nc1ncnc2n(cnc12)[C@@H](O[C@H](CO)C=O)C=O
: