Target
Adenosine deaminase
Ligand
BDBM50421667
Substrate
Meas. Tech.
ChEMBL_30932 (CHEMBL647741)
pH
7±n/a
Ki
28000±n/a nM
Comments
extracted
Citation
 Grant, AJLerner, LM Heat-induced formation of alpha,beta-unsaturated nucleoside dialdehydes and their activity with adenosine deaminase. J Med Chem 23:795-8 (1980)  
Target
Name:
Adenosine deaminase
Synonyms:
ADA Adenosine aminohydrolase
Type:
Enzyme
Mol. Mass.:
40910.44
Organism:
Bos taurus (bovine)
Description:
Residue:
363
  
Inhibitor
Name:
BDBM50421667
Synonyms:
CHEMBL2304163
Type:
Small organic molecule
Emp. Form.:
C10H11N5O3
Mol. Mass.:
249.226
SMILES:
C[C@H](O[C@@H](C=O)n1cnc2c(N)ncnc12)C=O
: