Target
Protease
Ligand
BDBM50485769
Substrate
Meas. Tech.
ChEMBL_858662 (CHEMBL2166544)
Ki
0.008000±n/a nM
Citation
 Parai, MKHuggins, DJCao, HNalam, MNAli, ASchiffer, CATidor, BRana, TM Design, synthesis, and biological and structural evaluations of novel HIV-1 protease inhibitors to combat drug resistance. J Med Chem 55:6328-41 (2012)  
Target
Name:
Protease
Synonyms:
Type:
Enzyme
Mol. Mass.:
10904.79
Organism:
Human immunodeficiency virus 1 (HIV-1)
Description:
Q9YQ12
Residue:
99
  
Inhibitor
Name:
BDBM50485769
Synonyms:
CHEMBL2165881
Type:
Small organic molecule
Emp. Form.:
C28H39N3O8S
Mol. Mass.:
577.69
SMILES:
CCCCCN(C[C@@H](O)[C@H](Cc1ccccc1)NC(=O)OCCN1CCOC1=O)S(=O)(=O)c1ccc(OC)cc1
: