Target
Reverse transcriptase protein
Ligand
BDBM50103642
Substrate
Meas. Tech.
ChEMBL_858888 (CHEMBL2167934)
IC50
10.0±n/a nM
Citation
 La Regina, GColuccia, ABrancale, APiscitelli, FFamiglini, VCosconati, SMaga, GSamuele, AGonzalez, EClotet, BSchols, DEsté, JANovellino, ESilvestri, R New nitrogen containing substituents at the indole-2-carboxamide yield high potent and broad spectrum indolylarylsulfone HIV-1 non-nucleoside reverse transcriptase inhibitors. J Med Chem 55:6634-8 (2012)  
Target
Name:
Reverse transcriptase protein
Synonyms:
Reverse Transcriptase Reverse Transcriptase (F61A)
Type:
Protein
Mol. Mass.:
30203.56
Organism:
Human immunodeficiency virus 1
Description:
Q9WJQ2
Residue:
259
  
Inhibitor
Name:
BDBM50103642
Synonyms:
4-(6-amino-5-bromo-2-(4-cyanophenylamino)pyrimidin-4-ylamino)-3,5-dimethylbenzonitrile 4-({6-AMINO-5-BROMO-2-[(4-CYANOPHENYL)AMINO]PYRIMIDIN-4-YL}OXY)-3,5-DIMETHYLBENZONITRILE CHEMBL308954 Etravirine (ETR) Etravirine (TMC125) TMC-125
Type:
Small organic molecule
Emp. Form.:
C20H15BrN6O
Mol. Mass.:
435.277
SMILES:
Cc1cc(cc(C)c1Oc1nc(Nc2ccc(cc2)C#N)nc(N)c1Br)C#N
: