Target
Acetolactate synthase, chloroplastic
Ligand
BDBM50486244
Substrate
Meas. Tech.
ChEMBL_893670 (CHEMBL3051048)
Ki
27100±n/a nM
Citation
 Shang, JWang, WMLi, YHSong, HBLi, ZMWang, JG Synthesis, crystal structure, in vitro acetohydroxyacid synthase inhibition, in vivo herbicidal activity, and 3D-QSAR of new asymmetric aryl disulfides. J Agric Food Chem 60:8286-93 (2012)  
Target
Name:
Acetolactate synthase, chloroplastic
Synonyms:
AHAS Acetolactate synthase ILVB_ARATH | TZP5
Type:
PROTEIN
Mol. Mass.:
72585.19
Organism:
Arabidopsis thaliana
Description:
ChEMBL_934103
Residue:
670
  
Inhibitor
Name:
BDBM50486244
Synonyms:
CHEMBL2229985
Type:
Small organic molecule
Emp. Form.:
C9H8N4O2S2
Mol. Mass.:
268.315
SMILES:
Cc1nc(SSc2ccccc2[N+]([O-])=O)n[nH]1
: