Target
Tyrosine-protein phosphatase non-receptor type 1
Ligand
BDBM13990
Substrate
Meas. Tech.
ChEMBL_900572 (CHEMBL3062587)
Ki
6900±n/a nM
Citation
  TBA Med Chem Res 20:714-725 (2011)    Article 
Target
Name:
Tyrosine-protein phosphatase non-receptor type 1
Synonyms:
PTN1_HUMAN PTPN1 Protein tyrosine phosphatase-1B (PTP1B) Protein-tyrosine phosphatase 1B (PTP1B) Tyrosine-protein phosphatase non-receptor type 1 (PTP1B)
Type:
Protein phosphatase
Mol. Mass.:
49963.76
Organism:
Homo sapiens (Human)
Description:
Human recombinant GST-fusion PTP1B (1-435).
Residue:
435
  
Inhibitor
Name:
BDBM13990
Synonyms:
5-{2-fluoro-5-[(1E)-3-[3-hydroxy-2-(methoxycarbonyl)phenoxy]prop-1-en-1-yl]phenyl}-1,2-oxazole-3-carboxylic acid Isoxazole carboxylic acid analog 1
Type:
Small organic molecule
Emp. Form.:
C21H16FNO7
Mol. Mass.:
413.3526
SMILES:
COC(=O)c1c(O)cccc1OC\C=C\c1ccc(F)c(c1)-c1cc(no1)C(O)=O
: