Target
Squalene synthase
Ligand
BDBM50029182
Substrate
Meas. Tech.
ChEMBL_202111 (CHEMBL808969)
IC50
1400±n/a nM
Citation
 Brown, GRButlin, RJChapman, SEakin, MAFoubister, AJFreeman, SGriffiths, DHarrison, PJJohnson, MCMallion, KB Phenoxypropylamines: a new series of squalene synthase inhibitors. J Med Chem 38:4157-60 (1995)  
Target
Name:
Squalene synthase
Synonyms:
FDFT_RAT Farnesyl-diphosphate farnesyltransferase SQS Squalene synthetase
Type:
PROTEIN
Mol. Mass.:
48109.41
Organism:
Rattus norvegicus
Description:
ChEMBL_1336736
Residue:
416
  
Inhibitor
Name:
BDBM50029182
Synonyms:
4-(2-Hydroxy-3-isopropylamino-propoxy)-benzoic acid ethyl ester | CHEMBL31608
Type:
Small organic molecule
Emp. Form.:
C15H23NO4
Mol. Mass.:
281.3474
SMILES:
CCOC(=O)c1ccc(OCC(O)CNC(C)C)cc1
: