Target
D(1A) dopamine receptor
Ligand
BDBM50029400
Substrate
Meas. Tech.
ChEMBL_58346 (CHEMBL880016)
IC50
1.1±n/a nM
Citation
 Bøgesø, KPArnt, JFrederiksen, KHansen, HOHyttel, JPedersen, H Enhanced D1 affinity in a series of piperazine ring substituted 1-piperazino-3-arylindans with potential atypical antipsychotic activity. J Med Chem 38:4380-92 (1995)  
Target
Name:
D(1A) dopamine receptor
Synonyms:
DOPAMINE D1 Dopamine D1 high Dopamine receptor Dopamine1-like Drd1a
Type:
Enzyme Catalytic Domain
Mol. Mass.:
49429.75
Organism:
RAT
Description:
P18901
Residue:
446
  
Inhibitor
Name:
BDBM50029400
Synonyms:
3-{4-[6-Chloro-3-(4-fluoro-phenyl)-indan-1-yl]-2,2-dimethyl-piperazin-1-yl}-propan-1-ol | CHEMBL136932
Type:
Small organic molecule
Emp. Form.:
C24H30ClFN2O
Mol. Mass.:
416.959
SMILES:
CC1(C)CN(CCN1CCCO)C1CC(c2ccc(Cl)cc12)c1ccc(F)cc1
: