Target
Type-1 angiotensin II receptor
Ligand
BDBM50047862
Substrate
Meas. Tech.
ChEMBL_901575 (CHEMBL3068556)
IC50
70±n/a nM
Citation
  TBA Med Chem Res 21:2307-2315 (2012)    Article 
Target
Name:
Type-1 angiotensin II receptor
Synonyms:
AGTR1 ANGIOTENSIN AT1 Angiotensin II type 1a (AT-1a) receptor
Type:
Enzyme Catalytic Domain
Mol. Mass.:
41009.15
Organism:
RABBIT
Description:
ANGIOTENSIN AT1 AGTR1 RABBIT::P34976
Residue:
359
  
Inhibitor
Name:
BDBM50047862
Synonyms:
CHEMBL154640 | N-[4-(3-Butyl-5-phenethylsulfanyl-[1,2,4]triazol-4-ylmethyl)-phenyl]-phthalamic acid
Type:
Small organic molecule
Emp. Form.:
C29H30N4O3S
Mol. Mass.:
514.639
SMILES:
CCCCc1nnc(SCCc2ccccc2)n1Cc1ccc(NC(=O)c2ccccc2C(O)=O)cc1
: