Target
Type-1 angiotensin II receptor
Ligand
BDBM50047832
Substrate
Meas. Tech.
ChEMBL_901575 (CHEMBL3068556)
IC50
11±n/a nM
Citation
  TBA Med Chem Res 21:2307-2315 (2012)    Article 
Target
Name:
Type-1 angiotensin II receptor
Synonyms:
AGTR1 ANGIOTENSIN AT1 Angiotensin II type 1a (AT-1a) receptor
Type:
Enzyme Catalytic Domain
Mol. Mass.:
41009.15
Organism:
RABBIT
Description:
ANGIOTENSIN AT1 AGTR1 RABBIT::P34976
Residue:
359
  
Inhibitor
Name:
BDBM50047832
Synonyms:
CHEMBL154027 | N-{4-[3-Butyl-5-(4-chloro-phenylmethanesulfinyl)-[1,2,4]triazol-4-ylmethyl]-phenyl}-2-(1H-tetrazol-5-yl)-benzamide
Type:
Small organic molecule
Emp. Form.:
C28H27ClN8O2S
Mol. Mass.:
575.084
SMILES:
CCCCc1nnc(n1Cc1ccc(NC(=O)c2ccccc2-c2nnn[nH]2)cc1)S(=O)Cc1ccc(Cl)cc1
: