Target
Neutrophil elastase
Ligand
BDBM50029721
Substrate
Meas. Tech.
ChEMBL_64004 (CHEMBL672345)
Ki
0.078±n/a nM
Citation
 Hlasta, DJAckerman, JHCourt, JJFarrell, RPJohnson, JAKofron, JLRobinson, DTTalomie, TGDunlap, RPFranke, CA A novel class of cyclic beta-dicarbonyl leaving groups and their use in the design of benzisothiazolone human leukocyte elastase inhibitors. J Med Chem 38:4687-92 (1995)  
Target
Name:
Neutrophil elastase
Synonyms:
Bone marrow serine protease Coagulation factor X ELANE Elastase HLE Leukocyte elastase Medullasin Neutrophil elastase (HNE) PMN elastase Trypsin
Type:
Enzyme
Mol. Mass.:
28532.38
Organism:
Homo sapiens (Human)
Description:
P08246
Residue:
267
  
Inhibitor
Name:
BDBM50029721
Synonyms:
2-(4-Isopropyl-6-methoxy-1,1,3-trioxo-1,3-dihydro-1lambda*6*-benzo[d]isothiazol-2-ylmethoxy)-pyrido[1,2-a]pyrimidin-4-one | CHEMBL434320
Type:
Small organic molecule
Emp. Form.:
C20H19N3O6S
Mol. Mass.:
429.446
SMILES:
COc1cc2c(C(=O)N(COc3cc(=O)n4ccccc4n3)S2(=O)=O)c(c1)C(C)C
: