Target
Type-1 angiotensin II receptor
Ligand
BDBM50030713
Substrate
Meas. Tech.
ChEMBL_899657 (CHEMBL3052668)
IC50
0.210378±n/a nM
Citation
  TBA Med Chem Res 21:2837-2853 (2012)    Article 
Target
Name:
Type-1 angiotensin II receptor
Synonyms:
AGTR1 ANGIOTENSIN AT1 Angiotensin II type 1a (AT-1a) receptor
Type:
Enzyme Catalytic Domain
Mol. Mass.:
41009.15
Organism:
RABBIT
Description:
ANGIOTENSIN AT1 AGTR1 RABBIT::P34976
Residue:
359
  
Inhibitor
Name:
BDBM50030713
Synonyms:
5-n-Butyl-4-[[2'-[N-(tert-butoxycarbonyl)sulfamoyl]biphenyl-4yl]methyl]-2-[2-chloro-5-(propionylamino)phenyl]-2,4-dihydro-3H-1,2,4-triazol-3-one N-{3-[3-Butyl-5-oxo-4-(2'-(N-t-butyloxycarbonyl)-Sulfanamido-biphenyl-4-ylmethyl)-4,5-dihydro-[1,2,4]triazol-1-yl]-4-chloro-phenyl}-propionamide
Type:
Small organic molecule
Emp. Form.:
C33H38ClN5O6S
Mol. Mass.:
668.203
SMILES:
CCCCc1nn(-c2cc(NC(=O)CC)ccc2Cl)c(=O)n1Cc1ccc(cc1)-c1ccccc1S(=O)(=O)NC(=O)OC(C)(C)C
: