Target
Substance-K receptor
Ligand
BDBM50030090
Substrate
Meas. Tech.
ChEMBL_143060 (CHEMBL750927)
Ki
>100000±n/a nM
Citation
 Barrow, CJDoleman, MSBobko, MACooper, R Structure determination, pharmacological evaluation, and structure-activity studies of a new cyclic peptide substance P antagonist containing the new amino acid 3-prenyl-beta-hydroxytyrosine, isolated from Aspergillus flavipes. J Med Chem 37:356-63 (1994)  
Target
Name:
Substance-K receptor
Synonyms:
NK-2 receptor NK2R NKNAR Neurokinin A receptor Neurokinin-2 (NK-2) SKR TACR2 Tachykinin receptor 2 (NK2) | hnk-3
Type:
Protein
Mol. Mass.:
44455.78
Organism:
Homo sapiens (Human)
Description:
P21452
Residue:
398
  
Inhibitor
Name:
BDBM50030090
Synonyms:
(R)-11-(1H-Indol-5-ylmethyl)-5-(1H-indol-3-ylmethyl)-17-isopropyl-hexadecahydro-3a,6,9,12,15,18,21-heptaaza-cyclopentacyclohenicosene-4,7,10,13,16,19,22-heptaone | CHEMBL2370512
Type:
Small organic molecule
Emp. Form.:
C38H45N9O7
Mol. Mass.:
739.82
SMILES:
[H][C@@]12CCCN1C(=O)[C@@H](Cc1c[nH]c3ccccc13)NC(=O)CNC(=O)[C@H](Cc1ccc3[nH]ccc3c1)NC(=O)CNC(=O)[C@@H](NC(=O)CNC2=O)C(C)C
: