Target
Substance-P receptor
Ligand
BDBM50030237
Substrate
Meas. Tech.
ChEMBL_143026 (CHEMBL857542)
IC50
7.2±n/a nM
Citation
 Lowe, JADrozda, SEMcLean, SBryce, DKCrawford, RTSnider, RMLongo, KPNagahisa, ATsuchiya, M Aza-tricyclic substance P antagonists. J Med Chem 37:2831-40 (1994)  
Target
Name:
Substance-P receptor
Synonyms:
NK-1 receptor NK1 Receptor NK1R_HUMAN Neurokinin-1 (NK-1) SPR TACR1 Tachykinin receptor 1 (NK1) | tachykinin
Type:
G Protein-Coupled Receptor (GPCR)
Mol. Mass.:
46254.43
Organism:
Homo sapiens (Human)
Description:
P25103
Residue:
407
  
Inhibitor
Name:
BDBM50030237
Synonyms:
(S)-((S)-9-Benzhydryl-4-oxa-8-aza-tricyclo[5.3.1.0*3,8*]undec-10-yl)-(2-methoxy-benzyl)-amine | CHEMBL317297
Type:
Small organic molecule
Emp. Form.:
C30H34N2O2
Mol. Mass.:
454.6032
SMILES:
COc1ccccc1CNC1C2CC3CCOC(C2)N3[C@H]1C(c1ccccc1)c1ccccc1
: