Target
Acetolactate synthase, chloroplastic
Ligand
BDBM50487049
Substrate
Meas. Tech.
ChEMBL_906554 (CHEMBL3067256)
Ki
220000±n/a nM
Citation
 Li, YXLuo, YPXi, ZNiu, CHe, YZYang, GF Design and syntheses of novel phthalazin-1(2H)-one derivatives as acetohydroxyacid synthase inhibitors. J Agric Food Chem 54:9135-9 (2006)  
Target
Name:
Acetolactate synthase, chloroplastic
Synonyms:
AHAS Acetolactate synthase ILVB_ARATH | TZP5
Type:
PROTEIN
Mol. Mass.:
72585.19
Organism:
Arabidopsis thaliana
Description:
ChEMBL_934103
Residue:
670
  
Inhibitor
Name:
BDBM50487049
Synonyms:
CHEMBL2253251
Type:
Small organic molecule
Emp. Form.:
C22H19ClN4O4
Mol. Mass.:
438.864
SMILES:
COc1cc(OC)nc(Oc2cccc3c(C)nn(Cc4cccc(Cl)c4)c(=O)c23)n1
: