Target
5-hydroxytryptamine receptor 1A
Ligand
BDBM50011252
Substrate
Meas. Tech.
ChEMBL_1172 (CHEMBL615844)
Ki
2920±n/a nM
Citation
 Liu, YYu, HMohell, NNordvall, GLewander, THacksell, U Derivatives of cis-2-amino-8-hydroxy-1-methyltetralin: mixed 5-HT1A-receptor agonists and dopamine D2-receptor antagonists. J Med Chem 38:150-60 (1995)  
Target
Name:
5-hydroxytryptamine receptor 1A
Synonyms:
5-HT-1A 5-HT1A 5-hydroxytryptamine receptor 1A (5HT1A) 5ht1a Htr1a Serotonin 1a (5-HT1a) receptor/Adrenergic receptor alpha-1 | Serotonin receptor 1A
Type:
G Protein-Coupled Receptor (GPCR)
Mol. Mass.:
46445.29
Organism:
Rattus norvegicus (rat)
Description:
Binding assays were performed using rat hippocampal membranes.
Residue:
422
  
Inhibitor
Name:
BDBM50011252
Synonyms:
7-Dipropylamino-8-methyl-5,6,7,8-tetrahydro-naphthalen-1-ol; hydrochloride CHEMBL541095
Type:
Small organic molecule
Emp. Form.:
C17H27NO
Mol. Mass.:
261.4024
SMILES:
CCCN(CCC)[C@H]1CCc2cccc(O)c2[C@H]1C
: