Target
Acetolactate synthase, chloroplastic
Ligand
BDBM50487173
Substrate
Meas. Tech.
ChEMBL_908731 (CHEMBL3066158)
Ki
70600±n/a nM
Citation
 Chen, CNChen, QLiu, YCZhu, XLNiu, CWXi, ZYang, GF Syntheses and herbicidal activity of new triazolopyrimidine-2-sulfonamides as acetohydroxyacid synthase inhibitor. Bioorg Med Chem 18:4897-904 (2010)  
Target
Name:
Acetolactate synthase, chloroplastic
Synonyms:
AHAS Acetolactate synthase ILVB_ARATH | TZP5
Type:
PROTEIN
Mol. Mass.:
72585.19
Organism:
Arabidopsis thaliana
Description:
ChEMBL_934103
Residue:
670
  
Inhibitor
Name:
BDBM50487173
Synonyms:
CHEMBL2251942
Type:
Small organic molecule
Emp. Form.:
C13H8F5N5O2S
Mol. Mass.:
393.292
SMILES:
Cc1nc(cc2nc(nn12)S(=O)(=O)Nc1c(F)cccc1F)C(F)(F)F
: