Target
Delta(14)-sterol reductase
Ligand
BDBM50003032
Substrate
Meas. Tech.
ChEMBL_909060 (CHEMBL3049784)
IC50
90±n/a nM
Citation
 Taton, MBenveniste, PRahier, A Microsomal delta 8,14-sterol delta 14-reductase in higher plants. Characterization and inhibition by analogues of a presumptive carbocationic intermediate of the reduction reaction. Eur J Biochem 185:605-14 (1989)  
Target
Name:
Delta(14)-sterol reductase
Synonyms:
100281352 | Delta(14)-sterol reductase
Type:
PROTEIN
Mol. Mass.:
41580.42
Organism:
Zea mays
Description:
ChEMBL_106555
Residue:
370
  
Inhibitor
Name:
BDBM50003032
Synonyms:
(4aS,5S,6S,8aS)-2-Dodecyl-5,8a-dimethyl-decahydro-isoquinolin-6-ol CHEMBL279569
Type:
Small organic molecule
Emp. Form.:
C23H45NO
Mol. Mass.:
351.6095
SMILES:
CCCCCCCCCCCCN1CC[C@H]2[C@H](C)[C@@H](O)CC[C@]2(C)C1
: