Target
D(3) dopamine receptor
Ligand
BDBM86473
Substrate
Meas. Tech.
ChEMBL_910807 (CHEMBL3057563)
IC50
4.1±n/a nM
Citation
  TBA Med Chem Res 13:25-33 (2004)    Article 
Target
Name:
D(3) dopamine receptor
Synonyms:
DOPAMINE D3 Dopamine D3 receptor | Drd3
Type:
Protein
Mol. Mass.:
49540.58
Organism:
Rattus norvegicus (Rat)
Description:
P19020
Residue:
446
  
Inhibitor
Name:
BDBM86473
Synonyms:
S32504 (+)
Type:
Small organic molecule
Emp. Form.:
C16H22N2O2
Mol. Mass.:
274.3581
SMILES:
CCCN1CCO[C@H]2[C@H]1CCc1ccc(cc21)C(N)=O
: