Target
Metabotropic glutamate receptor 2
Ligand
BDBM50030628
Substrate
Meas. Tech.
ChEMBL_219004 (CHEMBL818772)
IC50
48000±n/a nM
Citation
 Pellicciari, RLuneia, RCostantino, GMarinozzi, MNatalini, BJakobsen, PKanstrup, ALombardi, GMoroni, FThomsen, C 1-Aminoindan-1,5-dicarboxylic acid: a novel antagonist at phospholipase C-linked metabotropic glutamate receptors. J Med Chem 38:3717-9 (1995)  
Target
Name:
Metabotropic glutamate receptor 2
Synonyms:
GPRC1B GRM2_HUMAN Metabotropic glutamate receptor mGlu2 | metabotropic glutamate 2
Type:
Enzyme
Mol. Mass.:
95584.88
Organism:
Homo sapiens (Human)
Description:
Q14416
Residue:
872
  
Inhibitor
Name:
BDBM50030628
Synonyms:
(S)-4C3HPG 4-(Amino-carboxy-methyl)-2-hydroxy-benzoic acid(S-4C3HPG) CHEMBL444589
Type:
Small organic molecule
Emp. Form.:
C9H9NO5
Mol. Mass.:
211.1715
SMILES:
NC(C(O)=O)c1ccc(C(O)=O)c(O)c1
: