Target
Metabotropic glutamate receptor 4
Ligand
BDBM50030628
Substrate
Meas. Tech.
ChEMBL_219025 (CHEMBL818793)
IC50
>1000000±n/a nM
Citation
 Pellicciari, RLuneia, RCostantino, GMarinozzi, MNatalini, BJakobsen, PKanstrup, ALombardi, GMoroni, FThomsen, C 1-Aminoindan-1,5-dicarboxylic acid: a novel antagonist at phospholipase C-linked metabotropic glutamate receptors. J Med Chem 38:3717-9 (1995)  
Target
Name:
Metabotropic glutamate receptor 4
Synonyms:
GPRC1D GRM4_HUMAN MGLUR4 Metabotropic glutamate receptor 4 (mGlu4) metabotropic glutamate 4
Type:
Protein
Mol. Mass.:
101899.95
Organism:
Homo sapiens (Human)
Description:
Q14833
Residue:
912
  
Inhibitor
Name:
BDBM50030628
Synonyms:
(S)-4C3HPG 4-(Amino-carboxy-methyl)-2-hydroxy-benzoic acid(S-4C3HPG) CHEMBL444589
Type:
Small organic molecule
Emp. Form.:
C9H9NO5
Mol. Mass.:
211.1715
SMILES:
NC(C(O)=O)c1ccc(C(O)=O)c(O)c1
: