Target
Type-2 angiotensin II receptor
Ligand
BDBM50030713
Substrate
Meas. Tech.
ChEMBL_35413 (CHEMBL643587)
IC50
1.6±n/a nM
Citation
 Chang, LLAshton, WTFlanagan, KLChen, TBO'Malley, SSZingaro, GJKivlighn, SDSiegl, PKLotti, VJChang, RS Potent and orally active angiotensin II receptor antagonists with equal affinity for human AT1 and AT2 subtypes. J Med Chem 38:3741-58 (1995)  
Target
Name:
Type-2 angiotensin II receptor
Synonyms:
AGTR2_RAT Agtr2 Angiotensin II receptor Type-2 angiotensin II receptor
Type:
Enzyme Catalytic Domain
Mol. Mass.:
41346.62
Organism:
RAT
Description:
Angiotensin II AT2 0 0::P35351
Residue:
363
  
Inhibitor
Name:
BDBM50030713
Synonyms:
5-n-Butyl-4-[[2'-[N-(tert-butoxycarbonyl)sulfamoyl]biphenyl-4yl]methyl]-2-[2-chloro-5-(propionylamino)phenyl]-2,4-dihydro-3H-1,2,4-triazol-3-one N-{3-[3-Butyl-5-oxo-4-(2'-(N-t-butyloxycarbonyl)-Sulfanamido-biphenyl-4-ylmethyl)-4,5-dihydro-[1,2,4]triazol-1-yl]-4-chloro-phenyl}-propionamide
Type:
Small organic molecule
Emp. Form.:
C33H38ClN5O6S
Mol. Mass.:
668.203
SMILES:
CCCCc1nn(-c2cc(NC(=O)CC)ccc2Cl)c(=O)n1Cc1ccc(cc1)-c1ccccc1S(=O)(=O)NC(=O)OC(C)(C)C
: