Target
Adenosine kinase
Ligand
BDBM50090865
Substrate
Meas. Tech.
ChEMBL_911683 (CHEMBL3055330)
IC50
1200051820±n/a nM
Citation
  TBA Med Chem Res 13:479-496 (2004)    Article 
Target
Name:
Adenosine kinase
Synonyms:
ADK | ADK_HUMAN
Type:
PROTEIN
Mol. Mass.:
40545.97
Organism:
Homo sapiens (Human)
Description:
ChEMBL_1467841
Residue:
362
  
Inhibitor
Name:
BDBM50090865
Synonyms:
(2R,3R,4S,5R)-2-(4-Amino-5-iodo-pyrrolo[2,3-d]pyrimidin-7-yl)-5-methoxymethyl-tetrahydro-furan-3,4-diol 2-(4-Amino-5-iodo-pyrrolo[2,3-d]pyrimidin-7-yl)-5-methoxymethyl-tetrahydro-furan-3,4-diol | CHEMBL322217
Type:
Small organic molecule
Emp. Form.:
C12H15IN4O4
Mol. Mass.:
406.1764
SMILES:
COC[C@H]1O[C@H]([C@H](O)[C@@H]1O)n1cc(I)c2c(N)ncnc12
: