Target
Peroxisome proliferator-activated receptor alpha
Ligand
BDBM50103938
Substrate
Meas. Tech.
ChEMBL_911953 (CHEMBL3058294)
EC50
6251727±n/a nM
Citation
  TBA Med Chem Res 13:677-686 (2004)    Article 
Target
Name:
Peroxisome proliferator-activated receptor alpha
Synonyms:
NR1C1 PPAR PPAR-alpha PPARA_HUMAN Peroxisome proliferator-activated receptor | Peroxisome proliferator-activated receptor alpha (PPAR alpha)
Type:
Enzyme
Mol. Mass.:
52222.08
Organism:
Homo sapiens (Human)
Description:
Q07869
Residue:
468
  
Inhibitor
Name:
BDBM50103938
Synonyms:
2-Isopropoxy-3-[4-(5-phenyl-[1,2,4]oxadiazol-3-ylmethoxy)-phenyl]-propionic acid CHEMBL311429
Type:
Small organic molecule
Emp. Form.:
C21H22N2O5
Mol. Mass.:
382.4098
SMILES:
CC(C)OC(Cc1ccc(OCc2noc(n2)-c2ccccc2)cc1)C(O)=O
: