Target
Steroid 17-alpha-hydroxylase/17,20 lyase
Ligand
BDBM50407396
Substrate
Meas. Tech.
ChEMBL_204435 (CHEMBL811228)
IC50
4000±n/a nM
Citation
 Potter, GABarrie, SEJarman, MRowlands, MG Novel steroidal inhibitors of human cytochrome P45017 alpha (17 alpha-hydroxylase-C17,20-lyase): potential agents for the treatment of prostatic cancer. J Med Chem 38:2463-71 (1995)  
Target
Name:
Steroid 17-alpha-hydroxylase/17,20 lyase
Synonyms:
CP17A_HUMAN CYP17A1 Cytochrome P450 17A1 Cytochrome P450 C17 (CYP17) Cytochrome P450-C17 P450-C17 Steroid 17-alpha-Monooxygenase (CYP17) Steroid 17-alpha-monooxygenase | cytochrome P450 monooxygenase 17 alpha hydroxylase/17,20-lyase (CYP17)
Type:
Enzyme
Mol. Mass.:
57382.42
Organism:
Homo sapiens (Human)
Description:
E.coli expressing human CYP17
Residue:
508
  
Inhibitor
Name:
BDBM50407396
Synonyms:
CHEMBL2112299
Type:
Small organic molecule
Emp. Form.:
C24H31NO
Mol. Mass.:
349.509
SMILES:
C[C@]12CC[C@H]3[C@@H](CC=C4C[C@@H](O)CC[C@]34C)[C@@H]1CC=C2c1ccncc1
: