Target
Dipeptidyl peptidase 3
Ligand
BDBM26197
Substrate
Meas. Tech.
ChEMBL_913307 (CHEMBL3062799)
Ki
250000±n/a nM
Citation
 Dhanda, SSingh, JSingh, H Goat brain enkephalin degrading enzyme: interaction with analgesic and antihypertensive drugs Med Chem Res 20:1294-7 (2011)    Article 
Target
Name:
Dipeptidyl peptidase 3
Synonyms:
3.4.14.4 Dipeptidyl peptidase 3 M91_14005
Type:
PROTEIN
Mol. Mass.:
82027.05
Organism:
Bos mutus
Description:
ChEMBL_117383
Residue:
730
  
Inhibitor
Name:
BDBM26197
Synonyms:
CHEMBL112 Norco US9333197, Acetaminophen phenol derivative, 11
Type:
Small organic molecule
Emp. Form.:
C8H9NO2
Mol. Mass.:
151.1626
SMILES:
CC(=O)Nc1ccc(O)cc1
: