Target
Type-2 angiotensin II receptor
Ligand
BDBM50032368
Substrate
Meas. Tech.
ChEMBL_35417 (CHEMBL643591)
IC50
0.15±n/a nM
Citation
 Quan, MLChiu, ATEllis, CDWong, PCWexler, RRTimmermans, PB Balanced AT1/AT2 receptor antagonists. 4. XR510 and related 5-(3-amidopropanoyl)imidazoles possessing equal affinity for the AT1 and AT2 receptors. J Med Chem 38:2938-45 (1995)  
Target
Name:
Type-2 angiotensin II receptor
Synonyms:
AGTR2_RAT Agtr2 Angiotensin II receptor Type-2 angiotensin II receptor
Type:
Enzyme Catalytic Domain
Mol. Mass.:
41346.62
Organism:
RAT
Description:
Angiotensin II AT2 0 0::P35351
Residue:
363
  
Inhibitor
Name:
BDBM50032368
Synonyms:
CHEMBL98047 | butyloxy 2-[2-(4-{4-ethyl-5-[3-phenyl(butyl)carboxamidopropanoyl]-2-propyl-1H-1-imidazolylmethyl}-3-fluorophenyl)phenylsulfonyl]caboxamido
Type:
Small organic molecule
Emp. Form.:
C40H49FN4O6S
Mol. Mass.:
732.904
SMILES:
CCCC(=O)N(CCC(=O)c1c(CC)nc(CCC)n1Cc1ccc(cc1F)-c1ccccc1S(=O)(=O)NC(=O)OCCC(C)C)c1ccccc1
: