Target
Carboxypeptidase A1
Ligand
BDBM50236983
Substrate
Meas. Tech.
ChEMBL_916953 (CHEMBL3082947)
IC50
2730±n/a nM
Citation
 Morita, YMatsumura, EOkabe, TShibata, MSugiura, MOhe, TTsujibo, HIshida, NInamori, Y Biological activity of tropolone. Biol Pharm Bull 26:1487-90 (2003)  
Target
Name:
Carboxypeptidase A1
Synonyms:
CBPA1_BOVIN CPA1 Carboxypeptidase A (CPA) | Carboxypeptidase A1 precursor
Type:
Enzyme
Mol. Mass.:
47073.90
Organism:
Bos taurus (bovine)
Description:
From Sigma-Aldrich Co.
Residue:
419
  
Inhibitor
Name:
BDBM50236983
Synonyms:
2-Hydroxy-cyclohepta-2,4,6-trienone CHEMBL121188 | tropolone
Type:
Small organic molecule
Emp. Form.:
C7H6O2
Mol. Mass.:
122.1213
SMILES:
Oc1cccccc1=O
: