Target
Alpha-2B adrenergic receptor
Ligand
BDBM50033113
Substrate
Meas. Tech.
ChEMBL_33360 (CHEMBL644764)
Ki
528±n/a nM
Citation
 Hieble, JPBondinell, WERuffolo, RR Alpha- and beta-adrenoceptors: from the gene to the clinic. 1. Molecular biology and adrenoceptor subclassification. J Med Chem 38:3415-44 (1995)  
Target
Name:
Alpha-2B adrenergic receptor
Synonyms:
ADA2B_HUMAN ADRA2L1 Adrenergic alpha2B Adrenergic receptor alpha Alpha-2 adrenergic receptor subtype C2 Alpha-2B adrenoreceptor | Alpha-2BAR
Type:
Enzyme
Mol. Mass.:
49964.20
Organism:
Homo sapiens (Human)
Description:
P18089
Residue:
450
  
Inhibitor
Name:
BDBM50033113
Synonyms:
CHEMBL279516 INDORAMINE N-{1-[2-(1H-Indol-3-yl)-ethyl]-piperidin-4-yl}-benzamide N-{1-[2-(1H-Indol-3-yl)-ethyl]-piperidin-4-yl}-benzamide(indoramin)
Type:
Small organic molecule
Emp. Form.:
C22H25N3O
Mol. Mass.:
347.4534
SMILES:
O=C(NC1CCN(CCc2c[nH]c3ccccc23)CC1)c1ccccc1
: