Target
Alpha-1A adrenergic receptor
Ligand
BDBM50033113
Substrate
Meas. Tech.
ChEMBL_33746 (CHEMBL647664)
Ki
3.7±n/a nM
Citation
 Hieble, JPBondinell, WERuffolo, RR Alpha- and beta-adrenoceptors: from the gene to the clinic. 1. Molecular biology and adrenoceptor subclassification. J Med Chem 38:3415-44 (1995)  
Target
Name:
Alpha-1A adrenergic receptor
Synonyms:
ADA1A_HUMAN ADRA1C Alpha 1A-adrenoceptor Alpha adrenergic receptor 1a Alpha-adrenergic receptor 1c adrenergic Alpha1 | adrenergic Alpha1C
Type:
Cell-surface receptors
Mol. Mass.:
51511.67
Organism:
Homo sapiens (Human)
Description:
P35348
Residue:
466
  
Inhibitor
Name:
BDBM50033113
Synonyms:
CHEMBL279516 INDORAMINE N-{1-[2-(1H-Indol-3-yl)-ethyl]-piperidin-4-yl}-benzamide N-{1-[2-(1H-Indol-3-yl)-ethyl]-piperidin-4-yl}-benzamide(indoramin)
Type:
Small organic molecule
Emp. Form.:
C22H25N3O
Mol. Mass.:
347.4534
SMILES:
O=C(NC1CCN(CCc2c[nH]c3ccccc23)CC1)c1ccccc1
: