Target
Ecdysone receptor/Protein ultraspiracle homolog
Ligand
BDBM50178988
Substrate
Meas. Tech.
ChEMBL_927367 (CHEMBL3072567)
Ki
0.501187±n/a nM
Citation
 Tohidi-Esfahani, DLawrence, MCGraham, LDHannan, GNSimpson, AMHill, RJ Isoforms of the heteropteran Nezara viridula ecdysone receptor: protein characterisation, RH5992 insecticide binding and homology modelling. Pest Manag Sci 67:1457-67 (2011)  
Target
Name:
Ecdysone receptor/Protein ultraspiracle homolog
Synonyms:
Ecdysone receptor
Type:
Mol. Mass.:
Description:
ASSAY_ID of ChEMBL is 927367
Components:
This complex has 2 components.
Component 1
Name:
Ecdysone receptor
Synonyms:
Type:
PROTEIN
Mol. Mass.:
57629.46
Organism:
Choristoneura fumiferana
Description:
ChEMBL_65458
Residue:
513
  
Component 2
Name:
Protein ultraspiracle homolog
Synonyms:
NR2B4 Protein ultraspiracle homolog USP_CHOFU
Type:
PROTEIN
Mol. Mass.:
53145.42
Organism:
Choristoneura fumiferana
Description:
ChEMBL_106724
Residue:
472
  
Inhibitor
Name:
BDBM50178988
Synonyms:
CHEBI:38452 | Tebufenozide
Type:
Small organic molecule
Emp. Form.:
C22H28N2O2
Mol. Mass.:
352.4699
SMILES:
CCc1ccc(cc1)C(=O)NN(C(=O)c1cc(C)cc(C)c1)C(C)(C)C
: