Target
Acetylcholinesterase
Ligand
BDBM50169854
Substrate
Meas. Tech.
ChEMBL_931328 (CHEMBL3069985)
IC50
2980±n/a nM
Citation
  TBA Med Chem Res 22:2328-2345 (2013)    Article 
Target
Name:
Acetylcholinesterase
Synonyms:
ACES_RAT Acetylcholinesterase and butyrylcholinesterase (AChE and BChE) Acetylcholinesterase, AChE | Ache
Type:
Enzyme
Mol. Mass.:
68193.62
Organism:
Rattus norvegicus (rat)
Description:
P37136
Residue:
614
  
Inhibitor
Name:
BDBM50169854
Synonyms:
5,6-Dimethoxy-2-{4-[1-(4-methyl-piperazin-1-yl)-ethyl]-phenoxy}-indan-1-one | CHEMBL361540
Type:
Small organic molecule
Emp. Form.:
C24H30N2O4
Mol. Mass.:
410.506
SMILES:
COc1cc2CC(Oc3ccc(cc3)C(C)N3CCN(C)CC3)C(=O)c2cc1OC
: