Target
Peroxisome proliferator-activated receptor gamma
Ligand
BDBM50269531
Substrate
Meas. Tech.
ChEMBL_933250 (CHEMBL3069174)
IC50
6400±n/a nM
Citation
  TBA Med Chem Res 22:3126-3133 (2013)    Article 
Target
Name:
Peroxisome proliferator-activated receptor gamma
Synonyms:
NR1C3 PPAR-gamma PPARG_HUMAN Peroxisome proliferator-activated receptor gamma (PPAR gamma) Peroxisome proliferator-activated receptor gamma (PPARĪ³) peroxisome proliferator-activated receptor gamma isoform 2
Type:
Nuclear Receptor
Mol. Mass.:
57613.46
Organism:
Homo sapiens (Human)
Description:
P37231
Residue:
505
  
Inhibitor
Name:
BDBM50269531
Synonyms:
(9Z)-hexadec-9-enoic acid (Z)-hexadec-9-enoic acid 9-cis-hexadecenoic acid Palmitoleic acid (PoA) palmitoleic acid zoomaric acid
Type:
Small organic molecule
Emp. Form.:
C16H30O2
Mol. Mass.:
254.4082
SMILES:
CCCCCC\C=C/CCCCCCCC(O)=O
: