Target
Peroxisome proliferator-activated receptor alpha
Ligand
BDBM50152850
Substrate
Meas. Tech.
ChEMBL_933251 (CHEMBL3069175)
IC50
1500±n/a nM
Citation
  TBA Med Chem Res 22:3126-3133 (2013)    Article 
Target
Name:
Peroxisome proliferator-activated receptor alpha
Synonyms:
NR1C1 PPAR PPAR-alpha PPARA_HUMAN Peroxisome proliferator-activated receptor | Peroxisome proliferator-activated receptor alpha (PPAR alpha)
Type:
Enzyme
Mol. Mass.:
52222.08
Organism:
Homo sapiens (Human)
Description:
Q07869
Residue:
468
  
Inhibitor
Name:
BDBM50152850
Synonyms:
1-HEXYLDECANOIC ACID Hexadecanoic acid Palmitic acid (PA)
Type:
Small organic molecule
Emp. Form.:
C16H32O2
Mol. Mass.:
256.4241
SMILES:
CCCCCCCCCCCCCCCC(O)=O
: