Target
Thymidylate synthase
Ligand
BDBM50033928
Substrate
Meas. Tech.
ChEMBL_209795 (CHEMBL815661)
IC50
67±n/a nM
Citation
 Marsham, PRJackman, ALBarker, AJBoyle, FTPegg, SJWardleworth, JMKimbell, RO'Connor, BMCalvert, AHHughes, LR Quinazoline antifolate thymidylate synthase inhibitors: replacement of glutamic acid in the C2-methyl series. J Med Chem 38:994-1004 (1995)  
Target
Name:
Thymidylate synthase
Synonyms:
TS TYSY_MOUSE | Tyms
Type:
PROTEIN
Mol. Mass.:
34957.15
Organism:
Mus musculus
Description:
ChEMBL_1340097
Residue:
307
  
Inhibitor
Name:
BDBM50033928
Synonyms:
(R)-4-Carbamoyl-2-{4-[(2-methyl-4-oxo-3,4-dihydro-quinazolin-6-ylmethyl)-prop-2-ynyl-amino]-benzoylamino}-butyric acid | CHEMBL266509
Type:
Small organic molecule
Emp. Form.:
C25H25N5O5
Mol. Mass.:
475.4965
SMILES:
Cc1nc2ccc(CN(CC#C)c3ccc(cc3)C(=O)N[C@H](CCC(N)=O)C(O)=O)cc2c(=O)[nH]1
: