Target
Urease
Ligand
BDBM50488905
Substrate
Meas. Tech.
ChEMBL_931029 (CHEMBL3070477)
Ki
650±n/a nM
Citation
  TBA Med Chem Res 22:3653-3662 (2013)    Article 
Target
Name:
Urease
Synonyms:
UREA_CANEN | Urea amidohydrolase
Type:
Enzyme
Mol. Mass.:
90746.20
Organism:
Canavalia ensiformis (Jack bean) (Horse bean)
Description:
P07374
Residue:
840
  
Inhibitor
Name:
BDBM50488905
Synonyms:
CHEMBL2298023
Type:
Small organic molecule
Emp. Form.:
C15H15N3O4S2
Mol. Mass.:
365.427
SMILES:
COc1cccc(c1)C(=O)NC(=S)Nc1ccc(cc1)S(N)(=O)=O
: