Target
Urease
Ligand
BDBM50488914
Substrate
Meas. Tech.
ChEMBL_931029 (CHEMBL3070477)
Ki
1140±n/a nM
Citation
  TBA Med Chem Res 22:3653-3662 (2013)    Article 
Target
Name:
Urease
Synonyms:
UREA_CANEN | Urea amidohydrolase
Type:
Enzyme
Mol. Mass.:
90746.20
Organism:
Canavalia ensiformis (Jack bean) (Horse bean)
Description:
P07374
Residue:
840
  
Inhibitor
Name:
BDBM50488914
Synonyms:
CHEMBL1370012
Type:
Small organic molecule
Emp. Form.:
C12H11N3O4S2
Mol. Mass.:
325.363
SMILES:
NS(=O)(=O)c1ccc(NC(=S)NC(=O)c2ccco2)cc1
: