Target
Urease
Ligand
BDBM50488918
Substrate
Meas. Tech.
ChEMBL_931029 (CHEMBL3070477)
Ki
820±n/a nM
Citation
  TBA Med Chem Res 22:3653-3662 (2013)    Article 
Target
Name:
Urease
Synonyms:
UREA_CANEN | Urea amidohydrolase
Type:
Enzyme
Mol. Mass.:
90746.20
Organism:
Canavalia ensiformis (Jack bean) (Horse bean)
Description:
P07374
Residue:
840
  
Inhibitor
Name:
BDBM50488918
Synonyms:
CHEMBL2298024
Type:
Small organic molecule
Emp. Form.:
C16H17N3O5S2
Mol. Mass.:
395.453
SMILES:
COc1cccc(C(=O)NC(=S)Nc2ccc(cc2)S(N)(=O)=O)c1OC
: