Target
Urease
Ligand
BDBM50488919
Substrate
Meas. Tech.
ChEMBL_931029 (CHEMBL3070477)
Ki
890±n/a nM
Citation
  TBA Med Chem Res 22:3653-3662 (2013)    Article 
Target
Name:
Urease
Synonyms:
UREA_CANEN | Urea amidohydrolase
Type:
Enzyme
Mol. Mass.:
90746.20
Organism:
Canavalia ensiformis (Jack bean) (Horse bean)
Description:
P07374
Residue:
840
  
Inhibitor
Name:
BDBM50488919
Synonyms:
CHEMBL2298022
Type:
Small organic molecule
Emp. Form.:
C15H15N3O3S2
Mol. Mass.:
349.428
SMILES:
Cc1cccc(c1)C(=O)NC(=S)Nc1ccc(cc1)S(N)(=O)=O
: