Target
Urease
Ligand
BDBM50488920
Substrate
Meas. Tech.
ChEMBL_931029 (CHEMBL3070477)
Ki
450±n/a nM
Citation
  TBA Med Chem Res 22:3653-3662 (2013)    Article 
Target
Name:
Urease
Synonyms:
UREA_CANEN | Urea amidohydrolase
Type:
Enzyme
Mol. Mass.:
90746.20
Organism:
Canavalia ensiformis (Jack bean) (Horse bean)
Description:
P07374
Residue:
840
  
Inhibitor
Name:
BDBM50488920
Synonyms:
CHEMBL2298019
Type:
Small organic molecule
Emp. Form.:
C14H12N4O5S2
Mol. Mass.:
380.399
SMILES:
NS(=O)(=O)c1ccc(NC(=S)NC(=O)c2cccc(c2)[N+]([O-])=O)cc1
: