Target
Dipeptidyl peptidase 4
Ligand
BDBM50489031
Substrate
Meas. Tech.
ChEMBL_929372 (CHEMBL3074800)
Ki
3.8±n/a nM
Citation
  TBA Med Chem Res 22:4505-4521 (2013)    Article 
Target
Name:
Dipeptidyl peptidase 4
Synonyms:
ADABP Adenosine deaminase complexing protein 2 CD_antigen=CD26 DPP4 DPPIV Dipeptidyl peptidase 4 (DPP IV) Dipeptidyl peptidase 4 (DPP4) Dipeptidyl peptidase 4 membrane form Dipeptidyl peptidase IV Dipeptidyl peptidase IV (DDP-IV) Dipeptidyl peptidase IV membrane form Dipeptidyl peptidase-IV (DPP-4) T-cell activation antigen CD26 | TP103
Type:
Enzyme
Mol. Mass.:
88271.01
Organism:
Homo sapiens (Human)
Description:
P27487
Residue:
766
  
Inhibitor
Name:
BDBM50489031
Synonyms:
CHEMBL1230826
Type:
Small organic molecule
Emp. Form.:
C22H33N3O4
Mol. Mass.:
403.5151
SMILES:
CC(C)(C)c1cc(ccc1OC[C@H]1CC[C@H](N1)C(=O)N1CCC[C@H]1CN)C(O)=O
: