Target
Lactoperoxidase
Ligand
BDBM50489042
Substrate
Meas. Tech.
ChEMBL_929729 (CHEMBL3073038)
IC50
13900±n/a nM
Citation
  TBA Med Chem Res 22:4810-4817 (2013)    Article 
Target
Name:
Lactoperoxidase
Synonyms:
LPO PERL_BOVIN
Type:
Enzyme
Mol. Mass.:
80659.97
Organism:
Bos taurus (Bovine)
Description:
P80025
Residue:
712
  
Inhibitor
Name:
BDBM50489042
Synonyms:
CHEMBL2295876
Type:
Small organic molecule
Emp. Form.:
C15H10OS
Mol. Mass.:
238.304
SMILES:
S=c1oc(cc2ccccc12)-c1ccccc1
: