Target
Thromboxane-A synthase
Ligand
BDBM50034747
Substrate
Meas. Tech.
ChEMBL_210285 (CHEMBL808531)
IC50
>100000±n/a nM
Citation
 Ackerley, NBrewster, AGBrown, GRClarke, DSFoubister, AJGriffin, SJHudson, JASmithers, MJWhittamore, PR A novel approach to dual-acting thromboxane receptor antagonist/synthase inhibitors based on the link of 1,3-dioxane-thromboxane receptor antagonists and -thromboxane synthase inhibitors. J Med Chem 38:1608-28 (1995)  
Target
Name:
Thromboxane-A synthase
Synonyms:
CYP5 Cytochrome P450 5A1 TBXAS1 TXA synthase TXS Thromboxane A2 Synthase (P450 TxA2) Thromboxane prostanoid Thromboxane-A synthase
Type:
Enzyme
Mol. Mass.:
60524.67
Organism:
Homo sapiens (Human)
Description:
P24557
Residue:
533
  
Inhibitor
Name:
BDBM50034747
Synonyms:
(Z)-6-[(2S,4S,5R)-2-(2-Chloro-phenyl)-4-(2-hydroxy-phenyl)-[1,3]dioxan-5-yl]-hex-4-enoic acid ICI-192605
Type:
Small organic molecule
Emp. Form.:
C22H23ClO5
Mol. Mass.:
402.868
SMILES:
OC(=O)CC\C=C/C[C@@H]1CO[C@@H](O[C@@H]1c1ccccc1O)c1ccccc1Cl
: