Target
Thromboxane-A synthase
Ligand
BDBM50034759
Substrate
Meas. Tech.
ChEMBL_210285 (CHEMBL808531)
IC50
30±n/a nM
Citation
 Ackerley, NBrewster, AGBrown, GRClarke, DSFoubister, AJGriffin, SJHudson, JASmithers, MJWhittamore, PR A novel approach to dual-acting thromboxane receptor antagonist/synthase inhibitors based on the link of 1,3-dioxane-thromboxane receptor antagonists and -thromboxane synthase inhibitors. J Med Chem 38:1608-28 (1995)  
Target
Name:
Thromboxane-A synthase
Synonyms:
CYP5 Cytochrome P450 5A1 TBXAS1 TXA synthase TXS Thromboxane A2 Synthase (P450 TxA2) Thromboxane prostanoid Thromboxane-A synthase
Type:
Enzyme
Mol. Mass.:
60524.67
Organism:
Homo sapiens (Human)
Description:
P24557
Residue:
533
  
Inhibitor
Name:
BDBM50034759
Synonyms:
3-(2-{3-[(2S,4S,5R)-5-((Z)-5-Carboxy-pent-2-enyl)-4-(2-hydroxy-phenyl)-[1,3]dioxan-2-yl]-phenoxy}-ethoxy)-4-(2-imidazol-1-yl-ethoxy)-benzoic acid | CHEMBL290281
Type:
Small organic molecule
Emp. Form.:
C36H38N2O10
Mol. Mass.:
658.6943
SMILES:
OC(=O)CC\C=C/C[C@@H]1CO[C@@H](O[C@@H]1c1ccccc1O)c1cccc(OCCOc2cc(ccc2OCCn2ccnc2)C(O)=O)c1
: