Target
Thromboxane-A synthase
Ligand
BDBM50034760
Substrate
Meas. Tech.
ChEMBL_210285 (CHEMBL808531)
IC50
40±n/a nM
Citation
 Ackerley, NBrewster, AGBrown, GRClarke, DSFoubister, AJGriffin, SJHudson, JASmithers, MJWhittamore, PR A novel approach to dual-acting thromboxane receptor antagonist/synthase inhibitors based on the link of 1,3-dioxane-thromboxane receptor antagonists and -thromboxane synthase inhibitors. J Med Chem 38:1608-28 (1995)  
Target
Name:
Thromboxane-A synthase
Synonyms:
CYP5 Cytochrome P450 5A1 TBXAS1 TXA synthase TXS Thromboxane A2 Synthase (P450 TxA2) Thromboxane prostanoid Thromboxane-A synthase
Type:
Enzyme
Mol. Mass.:
60524.67
Organism:
Homo sapiens (Human)
Description:
P24557
Residue:
533
  
Inhibitor
Name:
BDBM50034760
Synonyms:
(E)-7-(4-{10-[(2S,4S,5R)-5-((Z)-5-Carboxy-pent-2-enyl)-4-(2-hydroxy-phenyl)-[1,3]dioxan-2-yl]-decyloxy}-phenyl)-7-pyridin-3-yl-hept-6-enoic acid | CHEMBL44865
Type:
Small organic molecule
Emp. Form.:
C44H57NO8
Mol. Mass.:
727.9253
SMILES:
OC(=O)CCCC\C=C(/c1ccc(OCCCCCCCCCC[C@H]2OC[C@@H](C\C=C/CCC(O)=O)[C@H](O2)c2ccccc2O)cc1)c1cccnc1
: