Target
Thromboxane-A synthase
Ligand
BDBM50034764
Substrate
Meas. Tech.
ChEMBL_210285 (CHEMBL808531)
IC50
3800±n/a nM
Citation
 Ackerley, NBrewster, AGBrown, GRClarke, DSFoubister, AJGriffin, SJHudson, JASmithers, MJWhittamore, PR A novel approach to dual-acting thromboxane receptor antagonist/synthase inhibitors based on the link of 1,3-dioxane-thromboxane receptor antagonists and -thromboxane synthase inhibitors. J Med Chem 38:1608-28 (1995)  
Target
Name:
Thromboxane-A synthase
Synonyms:
CYP5 Cytochrome P450 5A1 TBXAS1 TXA synthase TXS Thromboxane A2 Synthase (P450 TxA2) Thromboxane prostanoid Thromboxane-A synthase
Type:
Enzyme
Mol. Mass.:
60524.67
Organism:
Homo sapiens (Human)
Description:
P24557
Residue:
533
  
Inhibitor
Name:
BDBM50034764
Synonyms:
5-[(2S,4S,5R)-5-((Z)-5-Carboxy-pent-2-enyl)-4-(2-hydroxy-phenyl)-[1,3]dioxan-2-yl]-2-(2-imidazol-1-yl-ethoxy)-benzoic acid | CHEMBL294952
Type:
Small organic molecule
Emp. Form.:
C28H30N2O8
Mol. Mass.:
522.5464
SMILES:
OC(=O)CC\C=C/C[C@@H]1CO[C@@H](O[C@@H]1c1ccccc1O)c1ccc(OCCn2ccnc2)c(c1)C(O)=O
: