Target
DNA primase
Ligand
BDBM50013091
Substrate
Meas. Tech.
ChEMBL_81579 (CHEMBL689339)
IC50
59000±n/a nM
Citation
 Crute, JJLehman, IRGambino, JYang, TFMedveczky, PMedveczky, MKhan, NNMulder, CMonroe, JWright, GE Inhibition of herpes simplex virus type 1 helicase-primase by (dichloroanilino)purines and -pyrimidines. J Med Chem 38:1820-5 (1995)  
Target
Name:
DNA primase
Synonyms:
DNA helicase/primase complex protein | PRIM_HHV11
Type:
PROTEIN
Mol. Mass.:
114429.27
Organism:
Human herpesvirus 1 (strain 17) (HHV-1) (Human herpes simplex virus1)
Description:
ChEMBL_84513
Residue:
1058
  
Inhibitor
Name:
BDBM50013091
Synonyms:
2-(3,4-Dichloro-phenylamino)-1,9-dihydro-purin-6-one | CHEMBL51613
Type:
Small organic molecule
Emp. Form.:
C11H7Cl2N5O
Mol. Mass.:
296.112
SMILES:
Clc1ccc(Nc2nc3nc[nH]c3c(=O)[nH]2)cc1Cl
: