Target
DNA primase
Ligand
BDBM50034950
Substrate
Meas. Tech.
ChEMBL_81580 (CHEMBL689340)
IC50
850.0±n/a nM
Citation
 Crute, JJLehman, IRGambino, JYang, TFMedveczky, PMedveczky, MKhan, NNMulder, CMonroe, JWright, GE Inhibition of herpes simplex virus type 1 helicase-primase by (dichloroanilino)purines and -pyrimidines. J Med Chem 38:1820-5 (1995)  
Target
Name:
DNA primase
Synonyms:
DNA helicase/primase complex protein | PRIM_HHV11
Type:
PROTEIN
Mol. Mass.:
114429.27
Organism:
Human herpesvirus 1 (strain 17) (HHV-1) (Human herpes simplex virus1)
Description:
ChEMBL_84513
Residue:
1058
  
Inhibitor
Name:
BDBM50034950
Synonyms:
2-Amino-6-(3,4-dichloro-phenylamino)-3H-pyrimidin-4-one | CHEMBL54127
Type:
Small organic molecule
Emp. Form.:
C10H8Cl2N4O
Mol. Mass.:
271.103
SMILES:
Nc1nc(Nc2ccc(Cl)c(Cl)c2)cc(=O)[nH]1
: