Target
Anthrax toxin receptor 2
Ligand
BDBM23417
Substrate
Meas. Tech.
ChEMBL_938547 (CHEMBL2327386)
IC50
>300000±n/a nM
Citation
 Cryan, LMBazinet, LHabeshian, KACao, SClardy, JChristensen, KARogers, MS 1,2,3,4,6-Penta-O-galloyl-?-D-glucopyranose inhibits angiogenesis via inhibition of capillary morphogenesis gene 2. J Med Chem 56:1940-5 (2013)  
Target
Name:
Anthrax toxin receptor 2
Synonyms:
ANTR2_HUMAN Anthrax toxin receptor 2 CMG2 | Capillary morphogenesis gene 2 protein
Type:
PROTEIN
Mol. Mass.:
53667.55
Organism:
Homo sapiens
Description:
ChEMBL_118453
Residue:
489
  
Inhibitor
Name:
BDBM23417
Synonyms:
α-CA inhibitor, 4 (2R,3R)-2-(3,4-dihydroxyphenyl)-3,4-dihydro-2H-1-benzopyran-3,5,7-triol L-Epicatechin | cid_72276
Type:
Flavonol
Emp. Form.:
C15H14O6
Mol. Mass.:
290.2681
SMILES:
O[C@@H]1Cc2c(O)cc(O)cc2O[C@@H]1c1ccc(O)c(O)c1
: